{"text_format":"1","workbook":"xlsx","n_sheets":2,"sheets":["Measuring Up","Change Log"],"not_rendered":{"charts":0,"images":5,"macros":1,"external_links":0,"defined_names":5,"comments":1,"pivot_tables":0},"unopened":[],"bounds":{"document_bytes":16777216,"sheet_cells":100000,"rows_first":2000,"rows_last":500,"rows_between":2000,"halvings":0,"cell_chars":16384,"cell_head_chars":4096},"cells_cut":0,"cells_raw":0,"read":"whole","date_system":"1900"}

{"sheet":"Measuring Up","index":0,"n_rows":31,"n_cols":23,"rows_kept":31,"cut":false,"hidden":false,"merged":[[30,1,30,3],[30,5,30,7],[30,9,30,11],[30,13,30,15],[15,1,15,3],[15,5,15,7],[26,1,26,3],[26,5,26,7],[27,13,27,14],[28,13,28,14],[15,9,15,11],[26,9,26,11],[15,13,15,15],[26,13,26,15]]}
[null,null,null,null,null,null,null,null,null,null,null,null,null,null,null,null,null,null,null,null,null,null,"Diameter"]
[null,null,null,null,null,null,null,null,null,null,null,null,null,null,null,null,null,{"$f":"\"version - \"&LOOKUP(90000000000,'Change Log'!A:A)&\" (Jay Burke)\"","v":"version - 1.2 (Jay Burke)"},null,null,null,null,"Circumference"]
[null,null,null,null,null,null,null,null,null,null,null,null,null,null,null,null,null,"Important: Must Enable Macro's Upon Open"]
[]
[]
[]
[]
[]
[]
[]
[]
[]
[]
[null,{"$f":"IF(COUNT(B29:D29,F29:H29,J29:L29,N29:P29)>=1,\"Quick Tip: Clicking on box above, clears all dimensions on worksheet. | Clicking on illustrations below, clears only that dimension.\",\"Quick Tip: Enter dimensions of object to see recommended bag size.\")","v":"Quick Tip: Enter dimensions of object to see recommended bag size."}]
[]
[null,"Box Liner - Gusseted",null,null,null,"Pallet Cover - Gusseted",null,null,null,"Container Liner - Layflat",null,null,null,"Round Container - Layflat"]
[]
[]
[]
[]
[]
[]
[]
[]
[]
[]
[null,"- Box Dimensions - ",null,null,null,"- Pallet Dimensions - ",null,null,null,"- Container Dimensions - ",null,null,null,"- Round Container Dimensions - "]
[null,"Width","Depth","Height",null,"Width","Depth","Height",null,"Width","Depth","Height",null,"Diameter",null,"Height"]
[]
[]
[null,{"$f":"IF(COUNT(B29:D29)=3,\"Bag Size: \"&B29+1&\"\"\"W x \"&C29+1&\"\"\"D x \"&D29+C29+6&\"\"\"L\",\"\")","v":""},null,null,null,{"$f":"IF(COUNT(F29:H29)=3,\"Cover Size: \"&F29+2&\"\"\"W x \"&G29+2&\"\"\"D x \"&(H29+(G29/2))&\"\"\"L\",\"\")","v":""},null,null,null,{"$f":"IF(COUNT(J29:L29)=3,\"Bag Size: \"&J29+K29+2&\"\"\"W x \"&L29+K29+6&\"\"\"L\",\" \")","v":" "},null,null,null,{"$f":"IF(COUNT(N29:P29)=2,\"Bag Size: \"&ROUND(((N29*IF(N28=\"Diameter\",PI(),1))/2+1), 0)&\"\"\"W x \"&ROUND(P29+(N29/IF(N28=\"diameter\",1,PI()))+5,0)&\"\"\"L\",\"\")","v":""}]

{"sheet":"Change Log","index":1,"n_rows":3,"n_cols":2,"rows_kept":3,"cut":false,"hidden":false,"merged":[]}
["Version","Change Log"]
[1.1000000000000001,"Build"]
[1.2,"Reconfigured Reset Macros : \"Clicking on box above, clears all dimensions on worksheet. | Clicking on illustrations below, clears only that dimension.\" - (Thanks Jess!)"]